gluestack

gluestack Logogluestack

Execution failed for task ':react-native-svg:compileDebugJavaWithJavac'.

legend20001227 posted this in #support
Open in Discord
Avatar
legend20001227OP
after installing gluistack on my newly created expo project , i ran into this error saying

Task :react-native-svg:compileDebugJavaWithJavac FAILED

FAILURE: Build failed with an exception.

* What went wrong:
Execution failed for task ':react-native-svg:compileDebugJavaWithJavac'.
Compilation failed; see the compiler error output for details.

* Try:
Run with --info option to get more log output.
Run with --scan to get full insights.

BUILD FAILED in 1m
309 actionable tasks: 47 executed, 1 from cache, 261 up-to-date
Error: C:\Users\MSG\Desktop\Scrapays\new-offtake-app\android\gradlew.bat app:assembleDebug -x lint -x test --configure-on-demand --build-cache -PreactNativeDevServerPort=8081 -PreactNativeArchitectures=arm64-v8a,armeabi-v7a exited with non-zero code: 1

1 Reply